SL NO,FILE NO,NAME,CONTACT  NO.,AGE/SEX,SITE,DIAGNOSIS,T,N,M,STAGE,TYPE,FRACTIONS/DOSE  PLANNED,FRACTIONS DELIVERED,WEEK OF RT,DEFAULTED  AND NO OF DAYS OF RT DEFERRED,RECURRENCE,REASON,DATE OF STARTING,DATE OF DEFAULT,DATE OF RE-STARTING,COVID POSITIVE IN,CURRENT STATUS,SYMPTOMS OF COVID,ANY MEDICATION FOR COVID
1,1900692.0,SABITA MOHANTY,,,,BREAST,3,1,0.0,,,25,25.0,,no,,,,,,,,,
2,1901579.0,LALITA JOSHI,,,,esophagus,,,,,,28,28.0,,,yes,,,,,,,,
3,2000127.0,LAXMIDHAR SETHY,,,,MAXILLA,,,,,,35,35.0,,no,Yes,,,,,,,,
4,2000297.0,LAXMI BARIK,,,,SYNOVIAL SARCOMA,,,,,,5,1.0,,yes,,,2020-04-08,2020-04-09,,,,,
5,1901310.0,SANTOSH PALBABU,,,,TONGUE,,,,,,30,30.0,,no,,,,,,,,,
6,1900986.0,ANITA JHA,,,,BREAST,,,,,,30,30.0,,no,,,,,,,,,
7,2000186.0,ASHOK MAHAKUD,,,,GLOTTIS,,,,,,33,33.0,,no,,,,,,,,,
8,1901197.0,SHANTILATA MISHRA,,,,BREAST,,,,,,25,25.0,,no,,,,,,,,,
9,2000328.0,DEBARAJ SAHU,,,,VOCAL CORD,,,,,,33,33.0,,no,,,,,,,,,
10,2000205.0,NANIBALA PATRA,,,,CERVIX,,,,,,28,1.0,,yes,stable,,2020-04-13,2020-04-14,,,,,
11,2000221.0,GOURAHARI MALLICK,,,,LOWER ALVEOLUS,,,,,,30,30.0,,no,,,,,,,,,
12,1901574.0,SANTOSH KU PANDA,,,,GALL BLADDER,,,,,,25,25.0,,no,,,,,,,,,
13,1901299.0,PRAVATI JENA,,,,HODKIN LYMPHOMA,,,,,,18,18.0,,no,,,,,,,,,
14,2000006.0,SNEHALATA BEHERA,,,,RECTUM,,,,,,28,28.0,,no,,,,,,,,,
15,2000090.0,LAXMAN BHOL,,,,OROPHARYNX,,,,,,33,33.0,,no,,,,,,,,,
16,2000301.0,SUMIT SWARNAMAYA BISWAL,,,,TONGUE,,,,,,30,30.0,,no,,,,,,,,,
17,1901543.0,JIGNESH DAS,,,,SARCOMA,,,,,,23,23.0,,no,,,,,,,,,
18,2000280.0,JAGDISH NAHAK,,,,RHABDOMYOSARCOMA,,,,,,26,26.0,,no,,,,,,,,,
19,2000288.0,PRAVAT JENA,,,,MENINGIOMA,,,,,,30,30.0,,no,,,,,,,,,
20,1900853.0,RITESH MOHANTY,,,,MEDIASTINAL GCT,,,,,,3,3.0,,no,,,,,,,,,
21,1901133.0,SADHANA KHATUA,,,,BREAST,,,,,,20,20.0,,no,,,,,,,,,
22,1900993.0,SANDHYARANI DASH,,,,BREAST,,,,,,15,15.0,,no,,,,,,,,,
23,2000223.0,JHARI SAHOO,,,,TONGUE,,,,,,30,30.0,,no,,,,,,,,,
24,1900269.0,SABNAM NISHA,,,,BREAST,,,,,,30,30.0,,no,,,,,,,,,
25,2000070.0,PRAMILA SAHOO,,,,BREAST,,,,,,25,25.0,,no,,,,,,,,,
26,2000069.0,PRAVATI PALEI,,,,CERVIX,,,,,,25,25.0,,no,,,,,,,,,
27,1901050.0,SUKANTI PARIDA,,,,BREAST,,,,,,20,20.0,,no,,,,,,,,,
28,2000253.0,MANMOHAN MISHRA,,,,GLIOMA,,,,,,28,28.0,,no,,,,,,,,,
29,2000030.0,ISWAR BEHERA,,,,TONGUE,,,,,,33,33.0,,no,,,,,,,,,
30,1901162.0,LOPAMUDRA PATTANAYAK,,,,BREAST,,,,,,15,15.0,,no,,,,,,,,,
31,2000370.0,DILLIP MOHANTY,,,,TONGUE,,,,,,30,30.0,,NO,,,,,,,,,
32,1901192.0,AJIT DEHURY,,,,BUCCAL MUCOSA,,,,,,10,10.0,,NO,,,,,,,,,
33,2000373.0,JAYAJABAN KHOSLA,,,,BUCCAL MUCOSA,,,,,,30,30.0,,NO,,,,,,,,,
34,2000150.0,PRABHATI PALAI,,,,BREAST,,,,,,15,15.0,,NO,,,,,,,,,
35,2000399.0,SENDHIRI SENA,,,,TONGUE,,,,,,15,15.0,,NO,,,,,,,,,
36,2000242.0,MAMATA KAHANRA,,,,ANORECTUM,,,,,,28,28.0,,NO,,,,,,,,,
37,2000298.0,NEHERU NIAL,,,,SPINE,,,,,,25,25.0,,no,,,,,,,,,
38,1900808.0,PRAMILA SAHOO,,,,BREAST,,,,,,15,15.0,,NO,,,,,,,,,
39,2000407.0,MRUTUNJAY BARIK,,,,WILMS TUMOUR,,,,,,11,11.0,,NO,,,,,,,,,
40,2000388.0,SARBESWAR BHOL,,,,RECTUM,,,,,,28,28.0,,NO,,,,,,,,,
41,1901531.0,SANAT KU SAMANTA,,,,TONGUE,,TREATED FOR BONE METS,,,,,,,,,,,,,,,,
42,2000390.0,SAMBHU CH PURTY ,,,,RECTUM,,,,,,28,28.0,,NO,,,,,,,,,
43,2000220.0,SAROJINI TANTI,,,,PITUITARY ADENOMA,,,,,,28,28.0,,NO,,,,,,,,,
44,1901239.0,SAHNAJ BEGUM,,,,BREAST,,,,,,15,15.0,,NO,,,,,,,,,
45,2000245.0,RAKESH SAHOO,,,,GALL BLADDER,,,,,,25,25.0,,NO,,,,,,,,,
46,2000281.0,MAHENDRA MOHANTY,8895213334.0,65/M,HEAD & NECK,HYPOPHARYN,,,,IVA,CTRT,30#/66GY,14.0,3.0,YES,,,2020-08-20,2020-09-09,,SEPTEMBER,EXPIRED DUE TO DISEASE PROGRESSION IN DECEMBER,NIL,NIL
47,2000451.0,MAMATA SIKA,,,,FIBROMYOSARCOMA,,,,,,,,,,,,,,,,,,
48,2000159.0,NIRMALA PATRA,,,,BREAST,,,,,,10,10.0,,,,,,,,,,,
49,2000413.0,SAMBHU RANA,,,,LYMPHOMA,,,,,,25,25.0,,NO,,,,,,,,,
50,1901287.0,PREMALATA SAMAL,,,,BREAST,,,,,,20,20.0,,NO,,,,,,,,,
51,2000394.0,YASHRAJ JAGDEV,,,,ALL,,,,,,10,10.0,,NO,,,,,,,,,
52,2000337.0,REENA PANDA,,,,OESOPHAGUS,,,,,,31,31.0,,YES,1 WEEK,TOXICITY,2020-05-28,2020-07-03,2020-07-10,,,,
53,2000234.0,BRIJESH SAHA,,,,TONGUE,,,,,,39,37.0,,NO,NODAL DISEASE PROGRESSION,,,,,,,,
54,1901029.0,PADMALAYA SAMANTA,,,,BREAST,,,,,,15,15.0,,NO,,,,,,,,,
55,2000393.0,RANU BEHERA,,,,WILMS TUMOUR,,,,,,7,7.0,,NO,,,,,,,,,
56,2000041.0,GOLAP BISWAL,,,,HEMANGIOBLASTOMA,,,,,,25,25.0,,YES,1 WEEK,,2020-06-01,2020-07-03,2020-07-10,,,,
57,19001251.0,RUKMINI SAHANI,,,,BREAST,,,,,,25,25.0,,NO,,,,,,,,,
58,2000105.0,KAILASH PANDA,,,,TONGUE,,,,,,30,30.0,,NO,,,,,,,,,
59,1901255.0,NIBEDITA BIRA,,,,BREAST,,,,,,15,15.0,,NO,,,,,,,,,
60,1901002.0,TILOTTAMA PATTANAYAK,,,,BREAST,,,,,,15,15.0,,NO,,,,,,,,,
61,1901366.0,BASANTI DEVI,,,,BREAST,,,,,,25,25.0,,YES,1 WEEK,,2020-06-03,2020-07-03,2020-07-10,,,,
62,1901271.0,ANITA PALEI,,,,BREAST,,,,,,15,15.0,,NO,,,,,,,,,
63,1901316.0,JANAKI BARAL,,,,BREAST,,,,,,30,30.0,,NO,,,,,,,,,
64,1901215.0,JAMI KAMESWAR RAO,,,,BREAST,,,,,,25,25.0,,NO,1 WEEK- ? HOLIDAY,,2020-06-08,2020-07-03,2020-07-10,,,,
65,2000334.0,SUPRAVA DAS,,,,BREAST,,,,,,25,25.0,,YES,1 WEEK- ? HOLIDAY,,2020-06-08,2020-07-03,2020-07-10,,,,
66,2000436.0,RITANJALI ROUL,,,,BUCCAL MUCOSA,,,,,,30,30.0,,YES,TOXICITY,,2020-06-08,2020-07-03,2020-07-07,,,,
67,1900943.0,JAGYASENI PRADHAN,,,,PANCREAS,,,,,,10,10.0,,NO,,,,,,,,,
68,2000438.0,SUBHASHREE PRADHAN,,,,RHADBOMYOSARCOMA,,,,,,20,18.0,,NO,COVID POSITIVE,,2020-06-09,2020-07-04,,,,,
69,1901127.0,TIRTHA GIRI,,,,BREAST,,,,,,15,15.0,,NO,,,,,,,,,
70,2000450.0,JHUMPA DEI,,,,HARD PALATE,,,,,,10,10.0,,NO,,,,,,,,,
71,1901330.0,AMITA MISHRA,,,,BREAST,,,,,,25,25.0,,NO,,,,,,,,,
72,2000286.0,SUSANTA KU SAHOO,,,,RECTUM,,,,,,28,28.0,,NO,,,,,,,,,
73,2000415.0,RUTUPRABHA BAG,,,,ALL,,,,,,10,10.0,,NO,,,2020-06-15,,,,,,
74,2017015.0,BHASKAR DAKUA,,,,HARD PALATE,,,,,,28,28.0,,NO,,,2020-06-15,,,,,,
75,2000463.0,BIJAY KU MOHANTY,,,,DLBCL,,,,,,15,15.0,,NO,,,2020-06-15,,,,,,
76,1901461.0,MINATI RAJ,,,,BREAST,,,,,,33,33.0,,NO,,,2020-06-16,,,,,,
77,2000206.0,PANCHANAN SWAIN,,,,NASOPHARYNX,,,,,,30,30.0,,no,,,2020-06-16,,,,,,
78,2000472.0,MANJULA GIRI,,,,SARCOMA LEG,,,,,,30,30.0,,NO,,,2020-06-17,,,,,,
79,2000482.0,PUSPANAJLI PATTANAYAK,,,,BUCCAL MUCOSA,,,,,,33,33.0,,NO,,,2020-06-17,,,,,,
80,1901416.0,BINA JENA,,,,BREAST,3,2,,,,15,15.0,,NO,,,2020-06-18,,,,,,
81,1901536.0,SANJIB BISOYI,,,,RECTUM,4B,1,0.0,,,10,10.0,,NO,,,2020-06-18,,,,,,
82,2000112.0,DAMAYANTI ROUT,,,,BREAST,,,,,,25,10.0,,YES,,,2021-03-01,2020-03-12,,,,,
83,2000480.0,ASHOK PADHIARY,,,,RETROMOLAR TRIGONE,4,3,0.0,,,30,30.0,,NO,,,2020-06-22,,,,,,
84,1901090.0,RAJASHREE SAMAL,,,,BREAST,3,3,0.0,,,25,25.0,,NO,,,2020-06-24,,,,,,
85,2000243.0,SOUMYA PRIYADARSHINI SWAIN,8260178447.0,2/F,BILE DUCT,RHADBOMYOSARCOMA,,,,III,RT,20#/41.4GY,10.0,2.0,YES,COVID POSITIVE,,2020-06-16,2020-07-04,,AUGUST,STATUS UNKNOWN,,
86,2000477.0,AYUSH SETHY,,,,NEUROBLASTOMA,,,,,,12,12.0,,YES,,,2020-06-25,2020-07-04,2020-07-21,,,,
87,2000488.0,HARIHAR JAYASINGH,,,,BUCCAL MUCOSA,,,,,,10,1.0,,yes,PATIENT EXPIRED IN RTA,,2020-06-29,2020-06-30,,,,,
88,1901324.0,NIRUPAMA BEHERA,,,,BREAST,2,1,0.0,,,25,25.0,,yes,,,2020-06-29,2020-07-03,2020-07-10,,,,
89,2000316.0,ALAKA SWAIN,,,,BREAST,2,0,0.0,,,30,30.0,,yes,,,2020-06-29,2020-07-03,2020-07-10,,,,
90,2000453.0,BABU GHADEI,,,,SEMINOMA TESTIS,,,,,,10,7.0,,yes,personal reason,stable disease,2020-06-25,2020-07-03,2021-01-27,,,,
91,2000426.0,SMRUTIRANJAN MISHRA,,,,ALL,,,,,,10,10.0,,no,,,,,,,,,
92,2000351.0,DURGA SHANKAR DAS,,,,NASOPHARYNX,,,,,,33,33.0,,no,,,,,,,,,
93,2000353.0,GOPAL DAS,,,,ESOPHAGUS,,,,,,35,35.0,,no,,,2020-06-02,,,,,,
94,2000350.0,KAILASH CH SAHOO,,,,LARYNX,,,,,,30,30.0,,no,,,2020-06-01,,,,,,
95,2000539.0,SUCHITRA PATRA,,,,ESOPHAGUS,,,,,,23,23.0,,no,,,2020-07-01,,,,,,
96,1901411.0,LAXMI NAYAK,,,,RECURRENT WILMS TUMOUR,,,,,,18,18.0,,no,,,2020-07-02,,,,,,
97,2000562.0,BAIANI LENKA,,,,SCC FOOT,,,,,,15,15.0,,no,,,,,,,,,
98,2000471.0,BASANTA KU MOHANTY,,,,ESOPHAGUS,3,1,0.0,,,23,23.0,,no,no,,,,,,,,
99,1801247.0,SANTOSH KU SADANGI,,,,LUNG,,,,,,30,30.0,,no,yes,,2020-07-13,,,,,,
100,2000598.0,HARIHAR SAHOO,,,,PYRIFORM SINUS,4a,1,0.0,,,5,5.0,,no,no,,,,,,,,
101,2000587.0,ABHAY KU NAYAK,,,,SOFT PALATE,4a,1,0.0,,,30,30.0,,no,no,,,,,,,,
102,1901496.0,DROUPADI BARIK,,,,BREAST,3,1,0.0,,,25,25.0,,no,no,,,,,,,,
103,2000600.0,PUUSPANJALI SAHOO,,,,PITUITARY ADENOMA,,,,,,28,28.0,,no,no,,,,,,,,
104,2000102.0,REKHA DEI,,,,BREAST,2,1,0.0,,,30,30.0,,no,no,,,,,,,,
105,2000563.0,NIRMAL SEN,,,,CERVIX,IIIb,,,,,25,25.0,,yes,,toxicity,,,,,,,
106,2000313.0,BANANI MOHAPATRA,,,,BREAST,,,,,,25,25.0,,no,no,,,,,,,,
107,2000634.0,SUDHANSHU BARIK,,,,ALL,,,,,,7,7.0,,NO,,,,,,,,,
108,2000147.0,ANUSUYA BHANJA,,,,BREAST,,,,,,30,30.0,,NO,NO,,,,,,,,
109,2000636.0,GAYATRI PANDA,8249089776.0,38/F,BRAIN,MENINGIOMA,WHO II,,,GRADE -2,RT,30#/54GY,25.0,5.0,YES,NO,COVID POSITIVE,,2020-07-29,2020-09-02,SEPTEMBER,STATUS UNKNOWN,,
110,2000340.0,SASMITA KUMARI PANDA,,,,BREAST,,,,,,30,30.0,,NO,,,,,,,,,
111,2000646.0,TIKAYAT MOHANTA,,,,NHL THORAX,,,,,,15,15.0,,NO,NO,,,,,,,,
112,2000580.0,KALANDI CHARAN NAYAK,,,,GLOTTIS,,,,,,33,33.0,,NO,,,,,,,,,
113,1901514.0,SABITA MOHAPATRA,,,,BREAST,,,,,,30,30.0,,no,,,,,,,,,
114,2000063.0,BINODINI SETHI,,,,BREAST,2,0,0.0,,,25,18.0,,yes,,,2020-08-03,2020-08-27,,,,,
115,2000331.0,DAMAYANTI MISHRA,,,,BREAST,,,,,,25,25.0,,no,,,,,,,,,
116,2000635.0,RAJESH KU NAYAK,,,,PAROTID,2,0,0.0,,,30,30.0,,no,no,,2020-08-05,,,,,,
117,2000051.0,RANJAN KUMAR PRADHAN ,,,,TONGUE,4,2b,0.0,,,30,30.0,,no,,,,,,,,,
118,2000630.0,GOLAP BALIARSINGH,8249272274.0,62/F,GU,CERVIX,,record not in mosaic,,IIB,CCRT,50.4GY/28#,16.0,4.0,25,COVID POSITIVE,,,,,AUGUST,CLINICALLY CONTROLLED DISEASE,NIL,NIL
119,2000551.0,KRUSHNAPRIYA MANDHATA,,,,BREAST,2,1,0.0,,,25,25.0,,YES,COVID POSITIVE,,2020-08-10,2020-10-09,2020-09-28,,,,
120,2000639.0,SOUDAMINI SAHOO,9175475891.0,59/F,GI,ANAL CANAL,4A,1,0.0,IIIC,CCRT,30 (45GY/25# F/B BOOST 9GY/5#),30.0,4.0,NO,,treatment interruption due to toxicity,2020-08-10,,,SEPTEMBER,STATUS UNKNOWN,NIL,NIL
121,2000594.0,TAPAN KU SETHY,,,,TONGUE,,,,,,30,30.0,,yes,,,2020-08-10,2020-08-21,2020-09-28,,,,
122,2000086.0,DHUSASAN BHUYAN,,,,BREAST,4A,0,0.0,,,25,25.0,,NO,,,,,,,,,
123,2000662.0,DEBASMITA PANDA,,,,CERVIX,IIIb,,,,,28,28.0,,NO,,treatment interrupted,,,,,,,
124,2000429.0,BISWANATH MISHRA,,,,URINARY BLADDER,,,,,,15,6.0,,yes,,,2020-08-12,2020-08-20,,,,,
125,2000668.0,ASHOK KU SAHOO,,,,RMT,,,,,,30,30.0,,no,,,,,,,,,
126,2000661.0,RABINDRA MOHANTY,,,,LOWER LIP,,,,,,30,30.0,,no,,,2020-08-12,2020-08-25,2020-08-31,,,,
127,2000653.0,ASHOK KU BARIK,,,,SARCOMA,,record not in mosaic,,,,,,,,,,,,,,,,
128,2000564.0,RABINDRA PRADHAN,,,,SOFT PALATE,,,,,,10,10.0,,no,,,,,,,,,
129,2000666.0,MANAS RANJAN MALLICK,,,,BUCCAL MUCOSA,,,,,,30,30.0,,yes,,,2020-08-17,2020-09-12,2020-09-30,,,,
130,1901500.0,BANITA SASMAL,,,,BREAST,2,2,0.0,,,25,25.0,,no,,,2020-08-19,,,,,,
131,1800936.0,KAILASH CHANDRA RANA ,,,,ALVEOLUS,3,1,0.0,,,30,30.0,,no,,treatment interrupted,2020-08-19,,,,,,
132,2000660.0,HRUSIKESH BARIK,,,,TONGUE,,,,,,30,30.0,,yes,,,2020-08-19,2020-09-09,2020-09-14,,,,
133,2000579.0,KALPANA SWAIN,,,,RECTUM,4,1,0.0,,,28,28.0,,no,,,2020-08-22,,,,,,
134,2000672.0,ARJUN GIRI,8658780851.0,62/M,HEAD & NECK,BUCCAL MUCOSA,4a,0,0.0,IVA,RT,28#/61.6GY,28.0,4.0,yes/16,,,2020-08-20,2020-09-19,2020-10-05,SEPTEMBER,CLINICALLY AND RADIOLOGIALLY CONTROLLED DISEASE,NIL,NIL
135,2000702.0,BASANTI PRADHAN,9776301611.0,37/F,BREAST,BREAST,2,2,0.0,IIIA,RT,15#/40.05GY,15.0,2.0,yes/21,COVID POSITIVE,,2020-08-24,2020-09-08,2020-09-28,SEPTEMBER,STATUS UNKNOWN,,
136,2000111.0,JHARANA MOHAPATRA,,,,BREAST,2,2,0.0,,,25,25.0,,no,,treatment interrupted,2020-08-25,,,,,,
137,2000682.0,BASANTA PARIDA,,47/M,HEAD & NECK,TONGUE,,,,IVA,CTRT,30#/60GY,30.0,2.0,yes/19,,,2020-08-25,2020-09-05,2020-09-24,SEPTEMBER,LOCOREGIONAL RECURRENCE RADIOLOGICALLY,NIL,NIL
138,1901518.0,KUNI SAHOO,,33/F,BREAST,BREAST,2,,,IIB,RT,30(50GY/25# F/B BOOST 10GY/5#),30.0,2.0,yes/8,,,2020-08-26,2020-09-08,2020-09-17,SEPTEMBER,CLINICALLY CONTROLLED DISEASE ON MAINTAINANCE TRASTUZUMAB,NIL,NIL
139,2000318.0,REBATI BAG,,,,NHL LUMBAR,,record not in mosaic,,,,10,10.0,,NO,,,2020-08-26,,,,,,
140,2000486.0,SOMNATH PRADHAN,,,,BUCCAL MUCOSA,4b,1,0.0,,,35,35.0,,no,,,2020-08-31,,,,,,
141,2000691.0,SHAKTI PRASAD SARANGI,,,,ANAL CANAL,4,1,0.0,,,31,31.0,,no,,treatment interrupted ,2020-08-31,,,,,,
142,2000695.0,UMA RANI BEHERA,,,,FIBROMATOSIS,,,,,,27,27.0,,no,,,,,,,,,
143,2000718.0,ROSALIN PATRA,,,,ESTHESIONEUROBLASTOMA,,,,,,20,10.0,,yes,csf leak,,2020-09-01,,,,,,
144,2000362.0,SUSAMA KAR,,,,BREAST,2,1,0.0,,,30,30.0,,no,,,2020-09-02,,,,,,
145,2000489.0,RATIKANTA SAHOO,,,,TONGUE,4a,TREATED FOR RECURRENCE,0.0,,,35,35.0,,yes,,,2020-09-02,2020-09-05,2020-09-14,,,,
146,2000192.0,SUSANTI GAJENDRA,9437280167.0,36/F,BREAST,BREAST,2,1,0.0,IIB,RT,25#/50GY,6.0,2.0,yes,COVID POSITIVE,,2020-09-03,2020-09-12,,SEPTEMBER,CLINICALLY AND RADIOLOGICALLY CONTROLLED DISEASE,NIL,NIL
147,2000541.0,BALARAM DAS,,,,BUCCAL MUCOSA,4b,2b,0.0,,,10,10.0,,no,,,,,,,,,
148,2000730.0,SEKH KALIMUDDIN,,,,ORBITAL LYMPHOMA,,,,,,17,17.0,,yes,,,2020-09-07,2020-09-12,2020-09-30,,,,
149,2000474.0,DURGA PRASAD CHOWDURI,,,,RECTUM,4,2,0.0,,,28,28.0,,no,,,2020-09-09,,,,,,
150,2000199.0,SANTOSH KUMAR KHUNTIA,,,,TONGUE,,,,,,30,30.0,,no,multiple interruptions,,2020-09-14,2020-09-19,2020-09-25,,,,
151,2000734.0,SURESH KUMAR MISHRA ,,,,FIBROMATOSIS,,,,,,33,33.0,,no,,,2020-09-14,,,,,,
152,2000768.0,RABINDRA KUMAR DASH,,,,SUPRAGLOTTIC LARYNX,,,,,,33,33.0,,no,multiple interruptions,,2020-09-17,,,,,,
153,2000742.0,SANTOSH GOUDA,,,,ANAPLASTIC EPENDYMOMA,,,,,,30,30.0,,,,,2020-09-21,2020-10-23,2020-11-09,,,,
154,2000753.0,DEBENDRA KUMAR CHAMPATI,,,,BUCCAL MUCOSA,4A,1,0.0,,,30,30.0,,NO,,,2020-09-21,,,,,,
155,2000797.0,PRANAT KHATAI,,,,LEUKEMIA,,,,,,10,10.0,,NO,,,2020-09-23,,,,,,
156,2000610.0,SURENDRA KU SAHOO,,,,ALVEOLUS,4A,2B,0.0,,,10,10.0,,no,,,2020-09-23,,,,,,
157,2000435.0,LAXMIPRIYA SETHY,,,,STOMACH,4,2,0.0,,,25,25.0,,no,,,2020-09-23,,,,,,
158,2000110.0,GOUTAM ACHARYA,,,,RMT,4b,2b,0.0,,,10,10.0,,no,,,,,,,,,
159,2000432.0,SUDHANSHU SEKHAR BEHERA,,,,TONGUE,,,,,,33,33.0,,YES,,,2020-09-28,2020-11-10,2020-11-16,,,,
160,2000770.0,SITA BEHERA,,,,BREAST,,,,,,30,30.0,,NO,,,2020-09-28,,,,,,
161,1901264.0,ANUSUYA PAIKARAY,,,,BREAST,,,,,,25,25.0,,NO,,,2020-09-28,,,,,,
162,2000803.0,KALINGA ROUT,,,,B CELL ALL,,,,,,10,10.0,,NO,4 DAY GAP,,2020-09-28,,,,,,
163,2000784.0,UDAY SETHY,,,,HYPOHARYNX,4,3,0.0,,,10,10.0,,NO,,,2020-09-28,,,,,,
164,2000586.0,BAIJAYANTI BEHERA,,,,RECTUM,,,,,,28,28.0,,no,,,2020-09-23,,,,,,
165,2000804.0,SATYABAN NAYAK,,,,TONGUE,,,,,,27,26.0,,YES,,,2020-10-07,2020-10-09,2020-10-16,,,,
166,2000812.0,AYUSH KU DAS,,,,EPENDYMOMA,,,,,,30,3.0,,YES,COVID POSITIVE,,2020-10-07,2020-10-09,,,,,
167,2000739.0,BASANTA KU BEHERA,,,,RMT,,,,,,30,30.0,,NO,,,2020-10-12,,,,,,
168,2000816.0,NAMITA SAHOO,,,,BREAST,,,,,,25,25.0,,NO,,,2020-10-12,,,,,,
169,2000836.0,PARSURAM NAYAK,,,,ALL,,,,,,10,10.0,,NO,,,2020-10-12,,,,,,
170,2000805.0,SATYABHAMA NAYAK,,,,MENIONGIOMA,,,,,,30,30.0,,,multiple interruptions,,2020-10-12,,,,,,
171,2000793.0,SARAT KUMAR LENKA,,,,ASTROCYTOMA,,,,,,30,30.0,,no,,,2020-10-13,,,,,,
172,2000741.0,HEMRAJ PRADHAN,,,,OSTEOSARCOMA,,,,,,30,18.0,,no,plan changed midway,,2020-10-13,2020-10-27,2020-10-29,,,,
173,2000819.0,RASHMI RANJAN SAMANTARAY,,,,BUCCAL MUCOSA,,,,,,30,30.0,,no,,,2020-10-15,,,,,,
174,2000827.0,SUSHANT KUMAR ROUT,,,,TONGUE,,,,,,33,33.0,,,,,2020-10-19,,,,,,
175,2000823.0,CHITTARANJAN SAHOO,,,,TONGUE,2,0,0.0,,,33,33.0,,NO,DURGA PUJA HOLIDAY,,2020-10-20,,,,,,
176,2000707.0,HALADHAR SAHOO,,,,TONGUE,,,,,,30,30.0,,NO,DURGA PUJA HOLIDAY,,2020-10-21,,,,,,
177,2000764.0,SAGAR GOUDA,,,,ALL,,,,,,10,10.0,,NO,,,2020-10-20,,,,,,
178,2000800.0,SAILABALA MOHARANA ,,,,CERVIX,,,,,,28,28.0,,YES,,,2020-10-20,2020-10-29,2020-11-24,,,,
179,2000683.0,PRABHAKAR SAHOO,,,,RECTUM,,,,,,28,28.0,,NO,,,2020-10-22,,,,,,
180,2000815.0,PRATAP CH DAS,,,,NASOPHARYNX,,,,,,30,30.0,,NO,,,2020-10-22,,,,,,
181,2000878.0,AFROZ ALAM,,,,B CELL ALL FOR PCI,,record not in mosaic,,,,10,10.0,,NO,,,,,,,,,
182,2000825.0,BIJAY KU MAHARANA,,,,PYRIFORM SINUS,,,,,,30,9.0,,YES,,,2020-10-26,2020-11-09,,,,,
183,2000801.0,TUNA PATRA,,,,TONGUE,,,,,,30,30.0,,,,,2020-10-26,,,,,,
184,2000479.0,RANJANA JENA,,,,BREAST,,,,,,29,29.0,,NO,,,2020-10-26,,,,,,
185,2000156.0,SABITRI PATI,,,,BREAST,,,,,,25,6.0,,YES,NONE,,2020-03-16,2020-03-28,2020-11-16,,,,
186,2000865.0,ASHA JHA,,,,CNS LYMPHOMA,,,,,,15,15.0,,NO,,,2020-10-27,,,,,,
187,2000309.0,SHYAMALI RANA,,,,BREAST,,,,,,30,30.0,,NO,,,2020-10-28,,,,,,
188,2000269.0,BANITA SAHU,,,,EWING SARCOMA ,,,,,,30,30.0,,NO,,,2020-10-15,,,,,,
189,2001006.0,BAIKUNTHA PARIDA,,,,BUCCAL MUCOSA,4A,3B,0.0,,,33,3.0,,YES,,,2020-02-18,2020-12-22,,,,,
190,2000783.0,TILOTTAMA MOHAPATRA,,,,ANAPLASTIC ASTROCYTOMA,WHO III,,,,,30,0.0,,YES,,,2020-10-15,,,,,,
191,2000767.0,SANTOSH KU SAHU,,,,T CELL ALL FOR PCI,,,,,,10,0.0,,YES,,,2020-09-14,,,,,,
192,2000597.0,PRASANNA KU DASH,,,,TONGUE,4A,2B,0.0,,,33,8.0,,YES,PT DIDN’T WANT TO COME,,2020-12-21,2021-01-02,,,,,
193,2000895.0,RAMESH CHANDRA SUNDARAY,,,,LUNG,3,2,0.0,,,30,19.0,,,DEATH DUE TO COVID,,2020-12-14,2021-01-18,,,,,
194,1901349.0,MONALISHA BARIK,,,,BREAST,1,3A,0.0,,,25,0.0,,YES,DIDN’T COME DUE TO COVID,,2020-06-11,,,,,,
195,2001059.0,BHIKARI ROUTRAY,,,,GLIOBLASTOMA,WHO IV,,,,,30,0.0,,YES,DIDN’T COME DUE TO DEATH,,2020-12-23,,,,,,
196,2000607.0,MAHESWAR RAJ,,,,BUCCAL MUCOSA,4B,2C,0.0,,,33,0.0,,YES,DIDN’T COME DUE TO COVID,,2020-09-17,,,,,,
197,2000710.0,SAROJ BALA SWAIN,,,,CERVIX,FIGO IIB,,,,,28,0.0,,NO,PT WAS COVID POSITIVE,,2020-09-21,,,,,,
198,2000851.0,JHUNU SWAIN,,,,CERVIX,FIGO IVA,,,,,28,1.0,,YES,,,2020-11-12,2020-11-13,,,,,
199,2000640.0,GOKULA CHANDRA SAHOO,,,,URINARY BLADDER,4A,2B,0.0,,,28,0.0,,NOT STARTED,,,2020-10-19,,,,,,
200,2000971.0,JAYAN DEVI,,,,GLIOBLASTOMA,WHO IV,,,,,30,23.0,,YES,POOR GC,,2020-12-22,2021-01-22,,,,,
201,2000125.0,MANJU PALEI,,,,BREAST,3,1,0.0,,,25,6.0,,YES,personal reason,,2020-12-07,2020-01-14,,,,,
202,2000774.0,JYOTSNA BISWAL,7787843941.0,38/F,BREAST, BREAST,3,1,0.0,IIIA,RT,25#/50GY,25.0,1.0,NO,COVID POSITIVE,,2020-10-29,,,OCTOBER,CLINICALLY CONTROLLED DISEASE,NIL,VIT C
203,1901495.0,ANUSAYA MALLA,,,,BREAST,,,,,,25,25.0,,YES,COVID POSITIVE,,2020-06-24,2020-07-14,2020-09-07,,,,
204,2000700.0,KISHORI PRABHA BAL,,,,CERVIX,FIGO IIA,,,,,25,25.0,,YES,COVID POSITIVE,,2020-08-18,2020-09-10,2020-09-28,,,,
205,,SABITA MAHAPATRA,9124289909.0,50/F,BREAST,CA RIGHT BREAST,,,,IIIC,RT,50 GY/25# F/B BOOST 10 GY/5#,25.0,5.0,56,,,,,,SEPTEMEBER,CLINICALLY CONTROLLED DISEASE,NIL,VIT C 
206,,AYUSH KUMAR DAS,9938405107.0,5/M,BRAIN,EPENDYMOMA,,,,GRADE III,RT,54GY/30#,3.0,1.0,,,,,,,OCTOBER,EXPIRED DUE TO DISEASE PROGRESSION IN DECEMBER,NIL,NIL
207,,AHALYA PATRA,,70/F,BRAIN,MENINGIOMA,,,,,RT,54GY/30#,19.0,4.0,,,,,,,JUNE,STATUS UNKNOWN,,
208,,KISHORIPRABHA BAL,8128696328.0,75/F,GU,CA CERVIX,,,,IIA,CTRT,50GY/25#,20.0,4.0,19,,,,,,SEPTEMBER,"PERSISTENT SYMTOMS, RESIDUAL DISEASE,PT HAS NOT RECEIVED BRACHY",NIL,NIL
209,,NIRAKAR SUBUDHI,9178985909.0,38/M,HEAD AND NECK,CA TONGUE,,,,IVA,CTRT,69.96GY/33#,1.0,1.0,DEFAULTED,,,,,,SEPTEMBER,DISEASE PROGRESSION NOW ON SUPPORTIVE CARE ONLY,NIL,NIL
210,,JYOTSNARANI SAHOO,6296626174.0,44/F,BREAST,CA RIGHT BREAST,,,,IIIA,RT,50GY/25#,10.0,3.0,18,,,,,,SEPTEMBER,CLINICALLY CONTROLLED DISEASE,NIL,NIL
211,,ANASUYA MALLA,7978663833.0,52/F,BREAST,CA RIGHT BREAST,,,,IIB,RT,50GY/25#,10.0,2.0,53,,,,,,JULY,"CLINICALLY CONTROLLED DISEASE,NOW ON MAINTAINANCE TRASTUZUMAB",NIL,NIL
212,,SARASWATI CHOUDHARY,9437887193.0,69/F,HEAD AND NECK,CA TONGUE,,,,IVB,CTRT,66GY/33#,4.0,1.0,8,,,,,,SEPTEMBER,NODAL RECURRENCE AND LUNG METASTASES,NIL,NIL
213,,RANJURANI TRIPATHY,9937861448.0,46/F,GI,CA ESOPHAGUS,,,,II,RT,50.4GY/28#,11.0,2.0,26,,,,,,SEPTEMBER,STATUS UNKNOWN,NIL,NIL
214,,SRIDHAR ACHARYA,9438077860.0,73/M,SARCOMA,SYNOVIAL SARCOMA,,,,,RT,60GY/30#,25.0,5.0,26,,,,,,SEPTEMBER,DISEASE PROGRESSION CLINICALLY NOW ON PALLIATIVE CT,NIL,NIL
215,,ABHAYA KUMAR NAYAK,9040274025.0,56/M,HEAD AND NECK,CA PALATE,,,,III,RT,60GY/30#,21.0,3.0,26,,,,,,AUGUST,CLINICALLY CONTROLLED DISEASE,NIL,NIL
216,,DEBASISH BEHERA,9853822251.0,13/M,BONE,PNET VERTEBRA,,,,,RT,50.4GY/28#,10.0,2.0,13,,,,,,AUGUST,"STATUS UNKNOWN ,PATIENT CONTINUING CHEMOTHERAPY IN MED ONCO",NIL,NIL
217,,KRUSHNA PRIYA MANDHATA,9938371586.0,35/F,BREAST,CA RIGHT BREAST,,,,II,RT,50GY/25#,22.0,5.0,19,,,,,,SEPTEMBER,"CLINICALLY CONTROLLED DISEASE,POST COVID CHANGES IN HRCT",NIL,NIL
218,,RANGALATHA PANIGRAHI,7381056023.0,60/F,BREAST,CA RIGHT BREAST,,,,IIIA,RT,50GY/25#,8.0,2.0,5,,,,,,AUGUST,CLINICALLY  CONTROLLED DISEASE,NIL,NIL
